{"text_format":"1","workbook":"xlsx","n_sheets":4,"sheets":["inputForm","db","print","CODE"],"not_rendered":{"charts":0,"images":0,"macros":1,"external_links":0,"defined_names":43,"comments":0,"pivot_tables":0},"unopened":[],"bounds":{"document_bytes":16777216,"sheet_cells":100000,"rows_first":2000,"rows_last":500,"rows_between":2000,"halvings":0,"cell_chars":16384,"cell_head_chars":4096},"cells_cut":0,"cells_raw":0,"read":"whole","date_system":"1900"}

{"sheet":"inputForm","index":0,"n_rows":70,"n_cols":40,"rows_kept":70,"cut":false,"hidden":false,"merged":[[10,13,10,14],[12,29,12,33],[12,11,12,16],[15,11,15,14],[17,11,17,14],[23,1,23,15],[23,16,23,41],[21,36,21,38],[43,26,43,29],[39,2,39,14],[28,14,29,14],[29,2,31,13],[39,17,40,24],[34,2,34,13],[42,17,42,23],[69,5,69,7],[29,22,29,27],[32,16,32,24],[34,26,34,38],[34,16,34,25],[29,35,29,37],[43,30,43,41],[65,11,65,35],[54,7,54,17],[56,7,56,17],[57,7,57,17],[58,7,58,17],[52,24,52,38],[55,7,55,9],[55,12,55,17],[55,10,55,11],[48,16,48,41],[45,20,45,41],[68,26,68,35],[69,26,69,35],[67,26,67,35],[69,23,69,25],[69,8,69,18],[57,3,57,6],[54,3,54,6],[55,3,55,6],[56,3,56,6],[58,3,58,6],[68,5,68,7],[66,5,66,7],[66,23,66,25],[68,23,68,25],[67,8,67,18],[68,8,68,18],[0,1,0,4],[8,1,8,4],[21,31,21,35],[0,6,0,11],[6,1,6,19],[6,30,6,31],[6,23,6,28],[2,31,2,32],[10,7,10,10],[12,22,12,26],[10,22,10,25],[21,19,21,29],[19,7,19,16],[6,20,6,21],[8,14,8,36],[10,17,10,21],[4,0,4,30],[39,27,39,39],[41,35,41,37],[42,26,42,28],[42,29,42,31],[41,29,41,31],[41,26,41,28],[12,36,12,41],[26,1,27,6],[21,7,21,16],[6,34,6,39],[26,18,26,30],[26,31,26,39],[8,6,8,11],[42,2,42,14],[29,30,29,32]]}
[null,"วันที่รายงาน             ",null,null,null,null,null,null,null,null,null,null,null,null,null,null,null,null,null,null,null,null,null,null,null,null,null,null,null,null,null,null,null,null,null,"ครั้งที่รายงาน"]
[]
[null,null,null,null,null,null,null,null,null,null,null,null,null,null,null,null,null,null,null,null,null,null,null,null,null,null,null,null,null,null,null,"รหัส",null,"R"]
[null,null,null,null,null,null,null,null,null,null,null,null,null,null,null,null,null,null,null,null,null,null,null,null,null,null,null,null,null,null,null,null,null,null,"รหัสแปลงย่อย"]
["แบบฟอร์มติดตามผลการเข้าปฏิบัติการต่อพื้นที่ปลูกยางพาราในพื้นที่ป่าอนุรักษ์",null,null,null,null,null,null,null,null,null,null,null,null,null,null,null,null,null,null,null,null,null,null,null,null,null,null,null,null,null,null,null,"*** ใช้รหัสแปลงเดิมที่ได้ดำเนินการตรวจสอบแล้ว"]
[]
[null,"                                      สำนักบริหารพื้นที่อนุรักษ์ที่ ",null,null,null,null,null,null,null,null,null,null,null,null,null,null,null,null,null,null,{"$f":"VLOOKUP(AE7,CODE!B8:D28,3,FALSE)","v":2},null,"(",{"$f":"VLOOKUP(AE7,CODE!B8:C28,2,FALSE)","v":"ศรีราชา"},null,null,null,null,null,")","2A"]
[]
[null,"ประเภทพื้นที่",null,null,null,null,null,null,null,null,null,null,null,"ชื่อ ",{"$f":"VLOOKUP(AI3&AJ3&AK3&AL3,CODE!B39:C264,2,FALSE)","v":{"$error":"#N/A"}}]
[]
[null,"การใช้ที่ดิน",null,null,null,null,null," ยางพารา",null,null,null," อายุ ",null,null,null,"ปี",null,"เนื้อที่ประมาณ",null,null,null,null,null,null,null,null,"ไร่"]
[]
[null,"ที่ตั้ง",null,null,null,null," ชื่อหมู่บ้าน/ชุมชน ",null,null,null,null,null,null,null,null,null,null,"หมู่ที่",null,null,"ตำบล",null,null,null,null,null,null,"อำเภอ",null,null,null,null,null,null,"จังหวัด"]
[null,"ค่าพิกัดกลางแปลง",null,null,null,null,null,null,"  ในพื้นที่"]
[null,null,null," UTM WGS 84 Zone     "]
[null,null," UTM WGS 84 Zone     ",null,null,null,null,null,null,null,null," Easting",null,null,null,null,null,null,null,null,null,null,null,null,null,"m.E."]
[]
[null,null,null,null,null,null,null,null,null,null,null," Northing ",null,null,null,null,null,null,null,null,null,null,null,null,null,"m.N."]
[]
[null,"ผลการดำเนินการ"]
[null,null,null,null,null,null,null,null,null,null,null,null,null,null,null,null,null,null,null,null,null,null,null,null,null,null,null,null,null,null,null,null,null,null,null,null,null,4.8499999999999996]
[null,null,null,null,null,null,null,null,null,null,null,null,null,null,null,null,null,null,null,null,null,null,null,null,null,null,null,null,null,null,null,"เนื้อที่",null,null,null,null,{"$f":"W11","v":0},null,null,"ไร่"]
[]
[null,"กรณีที่อยู่ในแปลงพิสูจน์สิทธิ์ 30 มิ.ย. 41",null,null,null,null,null,null,null,null,null,null,null,null,null,null,"กรณีที่อยู่นอกแปลงพิสูจน์สิทธิ์ 30 มิ.ย. 41"]
[null,null,null,null,null,null,null,null,null,null,null,null,null,null,null,null," ผลการเข้าปฏิบัติการ"]
[]
[null,"  การดำเนินการ ",null,null,null,null,null,null,null,null,null,null,null,null,null,null,null,null,null,null,null,null,null,null,null,null,null,null,null,null,null,"ติดประกาศมาตรา22/25 ครั้งที่"]
[]
[]
[null,null,null,null,null,null,null,null,null,null,null,null,null,null,null,null,null,null,null,"เมื่อวันที่ ",null,null,null,null,null,null,null,null,"เนื้อที่",null,null,null,null,"ไร่"]
[]
[]
[null,null,null,null,null,null,null,null,null,null,null,null,null,null,null,null," ขั้นตอนการเข้าปฏิบัติการ"]
[]
[null,null,"(ชื่อผู้ครอบครอง/แจ้งการพิสูจน์สิทธิ์)",null,null,null,null,null,null,null,null,null,null,null,null,null,"สถานภาพต้นยางพารา",null,null,null,null,null,null,null,null,null,"แนวทางดำเนินการ (รื้อถอน)"]
[]
[]
[]
[]
[]
{"$rows_left_out":31}
{"sheet":"db","index":1,"n_rows":1,"n_cols":52,"rows_kept":1,"cut":false,"hidden":false,"merged":[]}
["รหัสรวม","วันที่รายงาน","ครั้งที่","รหัสแปลง","เลขแปลงย่อย","รหัส สบอ.","จังหวัด","ประเภทพื้นที่","ชื่อพื้นที่","การใช้ที่ดิน","อายุ(ปี)","เนื้อที่(ไร่)","ชื่อหมู่บ้าน/ชุมชน","หมู่ที่","ตำบล","อำเภอ","จังหวัด","โซน","Easting","Northing ","ผลการดำเนินการ","ผลการตรวจสอบ","เอกสารสิทธิ์อื่นๆ(โปรดระบุ)","เนื้อที่","กรณีที่อยู่ในแปลงพิสูจน์สิทธิ์ 30 มิ.ย. 41","ชื่อผู้ครอบครอง/แจ้งการพิสูจน์สิทธิ์","หมายเลขบัตรประชาชน 13 หลัก","กรณีที่อยู่นอกแปลงพิสูจน์สิทธิ์ 30 มิ.ย. 41","ประกาศครั้งที่","เมื่อวันที่","เนื้อที่","สถานภาพต้นยางพารา","แนวทางดำเนินการ (รื้อถอน)","ตัด(%)","เหลือ(%)","เนื้อที่ตัดฟัน(ไร่)","สาเหตุ","วันที่จับกุม","ปจว. ข้อ","เวลา","คดีอาญาที่","ยึดทรัพย์ที่","ชื่อผู้ต้องหา","ภาพประกอบ(P01)","ผู้รับผิดชอบ(หน่วยงาน)","ผู้ดำเนินการ","ตำแหน่งผู้ดำเนินการ","วันที่","ผู้รับผิดชอบพื้นที่","ตำแหน่งผู้รับผิดชอบพื้นที่","วันที่","หมายเหตุ"]

{"sheet":"print","index":2,"n_rows":70,"n_cols":41,"rows_kept":70,"cut":false,"hidden":false,"merged":[[10,22,10,25],[8,14,8,36],[0,1,0,4],[0,6,0,11],[2,31,2,32],[6,1,6,19],[6,20,6,21],[6,23,6,28],[4,0,4,30],[8,1,8,4],[8,6,8,11],[10,7,10,10],[10,13,10,14],[10,17,10,21],[23,1,23,15],[23,16,23,41],[12,22,12,26],[12,29,12,33],[12,36,12,41],[15,11,15,14],[17,11,17,14],[19,7,19,16],[21,7,21,16],[21,19,21,29],[21,31,21,35],[21,36,21,38],[12,10,12,16],[26,1,27,6],[28,14,29,14],[29,2,31,13],[29,22,29,27],[29,30,29,32],[29,35,29,37],[26,18,26,30],[26,31,26,39],[32,16,32,24],[34,16,34,25],[34,26,34,38],[34,2,34,13],[39,2,39,14],[39,17,40,24],[39,27,39,39],[41,26,41,28],[41,29,41,31],[41,35,41,37],[42,2,42,14],[42,17,42,23],[42,26,42,28],[42,29,42,31],[65,11,65,35],[66,5,66,7],[66,23,66,25],[43,26,43,29],[43,30,43,41],[52,24,52,38],[54,3,54,6],[54,7,54,17],[55,3,55,6],[56,3,56,6],[56,7,56,17],[55,7,55,9],[55,10,55,11],[55,12,55,17],[45,20,45,41],[69,5,69,7],[69,8,69,18],[69,23,69,25],[69,26,69,35],[48,16,48,41],[54,23,63,39],[67,8,67,18],[67,26,67,35],[68,5,68,7],[68,8,68,18],[68,23,68,25],[68,26,68,35],[57,3,57,6],[57,7,57,17],[58,3,58,6],[58,7,58,17]]}
[null,"วันที่รายงาน             ",null,null,null,null,{"$f":"VLOOKUP(AH3&AI3&AJ3&AK3&AL3&AM3&AN3&AO3&AP3&AM4&AN4&AO4&AP4&AO1&AP1,db!A2:B1164,2,FALSE)","v":{"$error":"#N/A"}},null,null,null,null,null,null,null,null,null,null,null,null,null,null,null,null,null,null,null,null,null,null,null,null,null,null,null,null,"ครั้งที่รายงาน"]
[]
[null,null,null,null,null,null,null,null,null,null,null,null,null,null,null,null,null,null,null,null,null,null,null,null,null,null,null,null,null,null,null,"รหัส",null,"R"]
[null,null,null,null,null,null,null,null,null,null,null,null,null,null,null,null,null,null,null,null,null,null,null,null,null,null,null,null,null,null,null,null,null,null,"รหัสแปลงย่อย"]
["แบบฟอร์มติดตามผลการเข้าปฏิบัติการต่อพื้นที่ปลูกยางพาราในพื้นที่ป่าอนุรักษ์",null,null,null,null,null,null,null,null,null,null,null,null,null,null,null,null,null,null,null,null,null,null,null,null,null,null,null,null,null,null,null,"*** ใช้รหัสแปลงเดิมที่ได้ดำเนินการตรวจสอบแล้ว"]
[]
[null,"                                      สำนักบริหารพื้นที่อนุรักษ์ที่ ",null,null,null,null,null,null,null,null,null,null,null,null,null,null,null,null,null,null,{"$f":"VLOOKUP(CONCATENATE(AH3,AI3,AJ3,AK3,AL3,AM3,AN3,AO3,AP3,AM4,AN4,AO4,AP4,AO1,AP1),db!$A$2:$F$1495,6,FALSE)","v":{"$error":"#N/A"}},null,"(",{"$f":"VLOOKUP(AH3&AI3&AJ3&AK3&AL3&AM3&AN3&AO3&AP3&AM4&AN4&AO4&AP4&AO1&AP1,db!$A$2:$G$1495,7,FALSE)","v":{"$error":"#N/A"}},null,null,null,null,null,")"]
[]
[null,"ประเภทพื้นที่",null,null,null,null,{"$f":"VLOOKUP(CONCATENATE(AH3,AI3,AJ3,AK3,AL3,AM3,AN3,AO3,AP3,AM4,AN4,AO4,AP4,AO1,AP1),db!$A$2:$H$1495,8,FALSE)","v":{"$error":"#N/A"}},null,null,null,null,null,null,"ชื่อ ",{"$f":"VLOOKUP(CONCATENATE(AH3,AI3,AJ3,AK3,AL3,AM3,AN3,AO3,AP3,AM4,AN4,AO4,AP4,AO1,AP1),db!$A$2:$I$1495,9,FALSE)","v":{"$error":"#N/A"}}]
[]
[null,"การใช้ที่ดิน",null,null,null,null,null,"ยางพารา",null,null,null," อายุ ",null,{"$f":"VLOOKUP(CONCATENATE(AH3,AI3,AJ3,AK3,AL3,AM3,AN3,AO3,AP3,AM4,AN4,AO4,AP4,AO1,AP1),db!$A$2:$K$1495,11,FALSE)","v":{"$error":"#N/A"}},null,"ปี",null,"เนื้อที่ประมาณ",null,null,null,null,{"$f":"VLOOKUP(CONCATENATE(AH3,AI3,AJ3,AK3,AL3,AM3,AN3,AO3,AP3,AM4,AN4,AO4,AP4,AO1,AP1),db!$A$2:$L$1495,12,FALSE)","v":{"$error":"#N/A"}},null,null,null,"ไร่"]
[]
[null,"ที่ตั้ง",null,null,null," ชื่อหมู่บ้าน/ชุมชน ",null,null,null,null,{"$f":"VLOOKUP(CONCATENATE(AH3,AI3,AJ3,AK3,AL3,AM3,AN3,AO3,AP3,AM4,AN4,AO4,AP4,AO1,AP1),db!$A$2:$M$1495,13,FALSE)","v":{"$error":"#N/A"}},null,null,null,null,null,null,"หมู่ที่",null,{"$f":"VLOOKUP(CONCATENATE(AH3,AI3,AJ3,AK3,AL3,AM3,AN3,AO3,AP3,AM4,AN4,AO4,AP4,AO1,AP1),db!$A$2:$N$1495,14,FALSE)","v":{"$error":"#N/A"}},"ตำบล",null,{"$f":"VLOOKUP(CONCATENATE(AH3,AI3,AJ3,AK3,AL3,AM3,AN3,AO3,AP3,AM4,AN4,AO4,AP4,AO1,AP1),db!$A$2:$O$1495,15,FALSE)","v":{"$error":"#N/A"}},null,null,null,null,"อำเภอ",null,{"$f":"VLOOKUP(CONCATENATE(AH3,AI3,AJ3,AK3,AL3,AM3,AN3,AO3,AP3,AM4,AN4,AO4,AP4,AO1,AP1),db!$A$2:$P$1495,16,FALSE)","v":{"$error":"#N/A"}},null,null,null,null,"จังหวัด",null,{"$f":"VLOOKUP(CONCATENATE(AH3,AI3,AJ3,AK3,AL3,AM3,AN3,AO3,AP3,AM4,AN4,AO4,AP4,AO1,AP1),db!$A$2:$Q$1495,17,FALSE)","v":{"$error":"#N/A"}}]
[null,"ค่าพิกัดกลางแปลง",null,null,null,null,null,null,"  ในพื้นที่"]
[]
[null,null,null," UTM WGS 84 Zone     ",null,null,null,null,null,{"$f":"VLOOKUP(CONCATENATE(AH3,AI3,AJ3,AK3,AL3,AM3,AN3,AO3,AP3,AM4,AN4,AO4,AP4,AO1,AP1),db!$A$2:$AY$1495,18,FALSE)","v":{"$error":"#N/A"}},null," Easting",null,null,null,null,null,null,{"$f":"MID(VLOOKUP(CONCATENATE(AH3,AI3,AJ3,AK3,AL3,AM3,AN3,AO3,AP3,AM4,AN4,AO4,AP4,AO1,AP1),db!$A$2:$AY$1495,19,FALSE),1,1)","v":{"$error":"#N/A"}},{"$f":"MID(VLOOKUP(CONCATENATE(AH3,AI3,AJ3,AK3,AL3,AM3,AN3,AO3,AP3,AM4,AN4,AO4,AP4,AO1,AP1),db!$A$2:$AY$1495,19,FALSE),2,1)","v":{"$error":"#N/A"}},{"$f":"MID(VLOOKUP(CONCATENATE(AH3,AI3,AJ3,AK3,AL3,AM3,AN3,AO3,AP3,AM4,AN4,AO4,AP4,AO1,AP1),db!$A$2:$AY$1495,19,FALSE),3,1)","v":{"$error":"#N/A"}},{"$f":"MID(VLOOKUP(CONCATENATE(AH3,AI3,AJ3,AK3,AL3,AM3,AN3,AO3,AP3,AM4,AN4,AO4,AP4,AO1,AP1),db!$A$2:$AY$1495,19,FALSE),4,1)","v":{"$error":"#N/A"}},{"$f":"MID(VLOOKUP(CONCATENATE(AH3,AI3,AJ3,AK3,AL3,AM3,AN3,AO3,AP3,AM4,AN4,AO4,AP4,AO1,AP1),db!$A$2:$AY$1495,19,FALSE),5,1)","v":{"$error":"#N/A"}},{"$f":"MID(VLOOKUP(CONCATENATE(AH3,AI3,AJ3,AK3,AL3,AM3,AN3,AO3,AP3,AM4,AN4,AO4,AP4,AO1,AP1),db!$A$2:$AY$1495,19,FALSE),6,1)","v":{"$error":"#N/A"}},null,"m.E."]
[]
[null,null,null,null,null,null,null,null,null,null,null," Northing ",null,null,null,null,null,{"$f":"MID(VLOOKUP(CONCATENATE(AH3,AI3,AJ3,AK3,AL3,AM3,AN3,AO3,AP3,AM4,AN4,AO4,AP4,AO1,AP1),db!$A$2:$AY$1495,20,FALSE),1,1)","v":{"$error":"#N/A"}},{"$f":"MID(VLOOKUP(CONCATENATE(AH3,AI3,AJ3,AK3,AL3,AM3,AN3,AO3,AP3,AM4,AN4,AO4,AP4,AO1,AP1),db!$A$2:$AY$1495,20,FALSE),2,1)","v":{"$error":"#N/A"}},{"$f":"MID(VLOOKUP(CONCATENATE(AH3,AI3,AJ3,AK3,AL3,AM3,AN3,AO3,AP3,AM4,AN4,AO4,AP4,AO1,AP1),db!$A$2:$AY$1495,20,FALSE),3,1)","v":{"$error":"#N/A"}},{"$f":"MID(VLOOKUP(CONCATENATE(AH3,AI3,AJ3,AK3,AL3,AM3,AN3,AO3,AP3,AM4,AN4,AO4,AP4,AO1,AP1),db!$A$2:$AY$1495,20,FALSE),4,1)","v":{"$error":"#N/A"}},{"$f":"MID(VLOOKUP(CONCATENATE(AH3,AI3,AJ3,AK3,AL3,AM3,AN3,AO3,AP3,AM4,AN4,AO4,AP4,AO1,AP1),db!$A$2:$AY$1495,20,FALSE),5,1)","v":{"$error":"#N/A"}},{"$f":"MID(VLOOKUP(CONCATENATE(AH3,AI3,AJ3,AK3,AL3,AM3,AN3,AO3,AP3,AM4,AN4,AO4,AP4,AO1,AP1),db!$A$2:$AY$1495,20,FALSE),6,1)","v":{"$error":"#N/A"}},{"$f":"MID(VLOOKUP(CONCATENATE(AH3,AI3,AJ3,AK3,AL3,AM3,AN3,AO3,AP3,AM4,AN4,AO4,AP4,AO1,AP1),db!$A$2:$AY$1495,20,FALSE),7,1)","v":{"$error":"#N/A"}},null,"m.N."]
[]
[null,"ผลการดำเนินการ",null,null,null,null,null,{"$f":"(VLOOKUP(CONCATENATE(AH3,AI3,AJ3,AK3,AL3,AM3,AN3,AO3,AP3,AM4,AN4,AO4,AP4,AO1,AP1),db!$A$2:$AY$1495,21,FALSE))","v":{"$error":"#N/A"}}]
[]
[null,null,null,null,null,null,null,{"$f":"(VLOOKUP(CONCATENATE(AH3,AI3,AJ3,AK3,AL3,AM3,AN3,AO3,AP3,AM4,AN4,AO4,AP4,AO1,AP1),db!$A$2:$AY$1495,22,FALSE))","v":{"$error":"#N/A"}},null,null,null,null,null,null,null,null,null,null,null,{"$f":"IF(VLOOKUP(CONCATENATE(AH3,AI3,AJ3,AK3,AL3,AM3,AN3,AO3,AP3,AM4,AN4,AO4,AP4,AO1,AP1),db!$A$2:$AY$1495,23,FALSE)=0,\"-\",(VLOOKUP(CONCATENATE(AH3,AI3,AJ3,AK3,AL3,AM3,AN3,AO3,AP3,AM4,AN4,AO4,AP4,AO1,AP1),db!$A$2:$AY$1495,23,FALSE)))","v":{"$error":"#N/A"}},null,null,null,null,null,null,null,null,null,null,null,"เนื้อที่",null,null,null,null,{"$f":"IF(VLOOKUP(CONCATENATE(AH3,AI3,AJ3,AK3,AL3,AM3,AN3,AO3,AP3,AM4,AN4,AO4,AP4,AO1,AP1),db!$A$2:$AY$1495,24,FALSE)=0,\"-\",(VLOOKUP(CONCATENATE(AH3,AI3,AJ3,AK3,AL3,AM3,AN3,AO3,AP3,AM4,AN4,AO4,AP4,AO1,AP1),db!$A$2:$AY$1495,24,FALSE)))","v":{"$error":"#N/A"}},null,null,"ไร่"]
[]
[null,"กรณีที่อยู่ในแปลงพิสูจน์สิทธิ์ 30 มิ.ย. 41",null,null,null,null,null,null,null,null,null,null,null,null,null,null,"กรณีที่อยู่นอกแปลงพิสูจน์สิทธิ์ 30 มิ.ย. 41"]
[null,null,null,null,null,null,null,null,null,null,null,null,null,null,null,null," ผลการเข้าปฏิบัติการ"]
[]
[null,"  การดำเนินการ ",null,null,null,null,null,null,null,null,null,null,null,null,null,null,null,null,{"$f":"IF(VLOOKUP(CONCATENATE(AH3,AI3,AJ3,AK3,AL3,AM3,AN3,AO3,AP3,AM4,AN4,AO4,AP4,AO1,AP1),db!$A$2:$AY$1495,28,FALSE)=1,CODE!K2,IF(VLOOKUP(CONCATENATE(AH3,AI3,AJ3,AK3,AL3,AM3,AN3,AO3,AP3,AM4,AN4,AO4,AP4,AO1,AP1),db!$A$2:$AY$1495,28,FALSE)=2,CODE!K3,IF(VLOOKUP(CONCATENATE(AH3,AI3,AJ3,AK3,AL3,AM3,AN3,AO3,AP3,AM4,AN4,AO4,AP4,AO1,AP1),db!$A$2:$AY$1495,28,FALSE)=7,CODE!K4,IF(VLOOKUP(CONCATENATE(AH3,AI3,AJ3,AK3,AL3,AM3,AN3,AO3,AP3,AM4,AN4,AO4,AP4,AO1,AP1),db!$A$2:$AY$1495,28,FALSE)=3,CODE!K5,IF(VLOOKUP(CONCATENATE(AH3,AI3,AJ3,AK3,AL3,AM3,AN3,AO3,AP3,AM4,AN4,AO4,AP4,AO1,AP1),db!$A$2:$AY$1495,28,FALSE)=4,CODE!K6,IF(VLOOKUP(CONCATENATE(AH3,AI3,AJ3,AK3,AL3,AM3,AN3,AO3,AP3,AM4,AN4,AO4,AP4,AO1,AP1),db!$A$2:$AY$1495,28,FALSE)=5,CODE!K7,IF(VLOOKUP(CONCATENATE(AH3,AI3,AJ3,AK3,AL3,AM3,AN3,AO3,AP3,AM4,AN4,AO4,AP4,AO1,AP1),db!$A$2:$AY$1495,28,FALSE)=6,CODE!K8,\"-\")))))))","v":{"$error":"#N/A"}},null,null,null,null,null,null,null,null,null,null,null,null,"ติดประกาศมาตรา22/25   ครั้งที่",null,null,null,null,null,null,null,null,{"$f":"IF(VLOOKUP(CONCATENATE(AH3,AI3,AJ3,AK3,AL3,AM3,AN3,AO3,AP3,AM4,AN4,AO4,AP4,AO1,AP1),db!$A$2:$AY$1495,29,FALSE)=0,\"-\",VLOOKUP(CONCATENATE(AH3,AI3,AJ3,AK3,AL3,AM3,AN3,AO3,AP3,AM4,AN4,AO4,AP4,AO1,AP1),db!$A$2:$AY$1495,29,FALSE))","v":{"$error":"#N/A"}}]
[]
[]
[null,null,{"$f":"IF(VLOOKUP(CONCATENATE(AH3,AI3,AJ3,AK3,AL3,AM3,AN3,AO3,AP3,AM4,AN4,AO4,AP4,AO1,AP1),db!$A$2:$AY$1495,25,FALSE)=1,CODE!C32,IF(VLOOKUP(CONCATENATE(AH3,AI3,AJ3,AK3,AL3,AM3,AN3,AO3,AP3,AM4,AN4,AO4,AP4,AO1,AP1),db!$A$2:$AY$1495,25,FALSE)=2,CODE!C33,IF(VLOOKUP(CONCATENATE(AH3,AI3,AJ3,AK3,AL3,AM3,AN3,AO3,AP3,AM4,AN4,AO4,AP4,AO1,AP1),db!$A$2:$AY$1495,25,FALSE)=3,CODE!C34,IF(VLOOKUP(CONCATENATE(AH3,AI3,AJ3,AK3,AL3,AM3,AN3,AO3,AP3,AM4,AN4,AO4,AP4,AO1,AP1),db!$A$2:$AY$1495,25,FALSE)=4,CODE!C35,\"-\"))))","v":{"$error":"#N/A"}},null,null,null,null,null,null,null,null,null,null,null,null,null,null,null,null,"เมื่อวันที่ ",null,null,{"$f":"IF(VLOOKUP(CONCATENATE(AH3,AI3,AJ3,AK3,AL3,AM3,AN3,AO3,AP3,AM4,AN4,AO4,AP4,AO1,AP1),db!$A$2:$AY$1495,30,FALSE)=0,\"-\",VLOOKUP(CONCATENATE(AH3,AI3,AJ3,AK3,AL3,AM3,AN3,AO3,AP3,AM4,AN4,AO4,AP4,AO1,AP1),db!$A$2:$AY$1495,30,FALSE))","v":{"$error":"#N/A"}},null,null,null,null,null,"   เนื้อที่",null,{"$f":"IF(VLOOKUP(CONCATENATE(AH3,AI3,AJ3,AK3,AL3,AM3,AN3,AO3,AP3,AM4,AN4,AO4,AP4,AO1,AP1),db!$A$2:$AY$1495,31,FALSE)=0,\"-\",VLOOKUP(CONCATENATE(AH3,AI3,AJ3,AK3,AL3,AM3,AN3,AO3,AP3,AM4,AN4,AO4,AP4,AO1,AP1),db!$A$2:$AY$1495,31,FALSE))","v":{"$error":"#N/A"}},null,null,"ไร่"]
[]
[]
[null,null,null,null,null,null,null,null,null,null,null,null,null,null,null,null," ขั้นตอนการเข้าปฏิบัติการ"]
[]
[null,null,"(ชื่อผู้ครอบครอง/แจ้งการพิสูจน์สิทธิ์)",null,null,null,null,null,null,null,null,null,null,null,null,null,"สถานภาพต้นยางพารา",null,null,null,null,null,null,null,null,null,"แนวทางดำเนินการ (รื้อถอน)"]
[]
[]
[]
[]
[null,null,{"$f":"IF(VLOOKUP(CONCATENATE(AH3,AI3,AJ3,AK3,AL3,AM3,AN3,AO3,AP3,AM4,AN4,AO4,AP4,AO1,AP1),db!$A$2:$AY$1495,26,FALSE)=0,\"-\",(VLOOKUP(CONCATENATE(AH3,AI3,AJ3,AK3,AL3,AM3,AN3,AO3,AP3,AM4,AN4,AO4,AP4,AO1,AP1),db!$A$2:$AY$1495,26,FALSE)))","v":{"$error":"#N/A"}},null,null,null,null,null,null,null,null,null,null,null,null,null,null,{"$f":"IF(VLOOKUP(CONCATENATE(AH3,AI3,AJ3,AK3,AL3,AM3,AN3,AO3,AP3,AM4,AN4,AO4,AP4,AO1,AP1),db!$A$2:$AY$1495,32,FALSE)=1,CODE!E32,IF(VLOOKUP(CONCATENATE(AH3,AI3,AJ3,AK3,AL3,AM3,AN3,AO3,AP3,AM4,AN4,AO4,AP4,AO1,AP1),db!$A$2:$AY$1495,32,FALSE)=2,CODE!E33,IF(VLOOKUP(CONCATENATE(AH3,AI3,AJ3,AK3,AL3,AM3,AN3,AO3,AP3,AM4,AN4,AO4,AP4,AO1,AP1),db!$A$2:$AY$1495,32,FALSE)=3,CODE!E34,\"-\")))","v":{"$error":"#N/A"}},null,null,null,null,null,null,null,null,null,{"$f":"IF(VLOOKUP(CONCATENATE(AH3,AI3,AJ3,AK3,AL3,AM3,AN3,AO3,AP3,AM4,AN4,AO4,AP4,AO1,AP1),db!$A$2:$AY$1495,33,FALSE)=1,CODE!F32,IF(VLOOKUP(CONCATENATE(AH3,AI3,AJ3,AK3,AL3,AM3,AN3,AO3,AP3,AM4,AN4,AO4,AP4,AO1,AP1),db!$A$2:$AY$1495,33,FALSE)=2,CODE!F33,IF(VLOOKUP(CONCATENATE(AH3,AI3,AJ3,AK3,AL3,AM3,AN3,AO3,AP3,AM4,AN4,AO4,AP4,AO1,AP1),db!$A$2:$AY$1495,33,FALSE)=3,CODE!F34,IF(VLOOKUP(CONCATENATE(AH3,AI3,AJ3,AK3,AL3,AM3,AN3,AO3,AP3,AM4,AN4,AO4,AP4,AO1,AP1),db!$A$2:$AY$1495,33,FALSE)=4,CODE!F35,IF(VLOOKUP(CONCATENATE(AH3,AI3,AJ3,AK3,AL3,AM3,AN3,AO3,AP3,AM4,AN4,AO4,AP4,AO1,AP1),db!$A$2:$AY$1495,33,FALSE)=5,CODE!F36,\"-\")))))","v":{"$error":"#N/A"}}]
{"$rows_left_out":31}
{"sheet":"CODE","index":3,"n_rows":264,"n_cols":11,"rows_kept":264,"cut":false,"hidden":false,"merged":[[15,5,18,5],[19,5,21,5],[7,14,7,17],[10,16,10,23],[14,13,14,14],[14,17,14,20],[14,21,14,22]]}
["ยางพารา_text4","type","zone","result","list1","list2","list3","สถานภาพต้นยางพารา","line","30JUNE","UN30"]
[{"$f":"IF(inputForm!G11=1,1,0)","v":0}," ป่าอนุรักษ์",47,"ตรวจสอบพื้นที่แล้ว","อยู่ในแปลงพิสูจน์สิทธิ์ 30 มิ.ย. 41","อยู่นอกแปลงพิสูจน์สิทธิ์ 30 มิ.ย. 41","มีเอกสารสิทธิ์อื่น ๆ (โปรดระบุ)","ยังไม่เปิดกรีด","ตัดหมด ","รังวัดแปลงที่ดินแล้วเสร็จ","เข้าปฏิบัติการและดำเนินการตามมาตรา 22 แล้ว"]
[null," ป่าสงวนแห่งชาติ",48,"ยังไม่ได้ดำเนินการตรวจสอบ","ยังไม่ได้ดำเนินการตรวจสอบ",null,null,"ระหว่างให้น้ำยาง","ยังไม่ได้ดำเนินการตัด","อยู่ระหว่างการรังวัดแปลงที่ดิน","เข้าปฏิบัติการและดำเนินการตามมาตรา 25 แล้ว"]
[null," พื้นที่อื่นๆ",null,null,null,null,null,"หยุดกรีดยางมากกว่า 6 เดือน","อัตราการตัดฟัน","ตรวจสอบการครอบครองแล้วเสร็จ","เข้าปฏิบัติการตาม พรบ. ป่าไม้ พ.ศ. 2484"]
[null,null,null,null,null,null,null,null,"ชักลากออกมาใช้ประโยชน์","อยู่ระหว่างตรวจสอบการครอบครอง","ยังไม่เข้าปฏิบัติการ"]
[null,null,null,null,null,null,null,null,"ไม่ตัดปล่อยให้คืนสภาพเป็นป่า",null,"ราษฎรยินดีส่งคืนพื้นที่อย่างไม่มีเงื่อนไข"]
[null,"paro_code","paro",null,null,null,null,null,null,null,"ไม่มีการดำเนินทางคดี"]
[null,"1A","ปราจีนบุรี",1,null,"กรณีที่อยู่ในแปลงพิสูจน์สิทธิ์ 30 มิ.ย. 41",{"$f":"IF(inputForm!H20=CODE!D2,IF(inputForm!H22=CODE!E2,IF(inputForm!C30=CODE!J2,1,\"\")&IF(inputForm!C30=J3,2,\"\")&IF(inputForm!C30=J4,3,\"\")&IF(inputForm!C30=J5,4,\"\"),0),0)","v":0},"manage",null,null,"รอผลคดี"]
[null,"1B","สาขาสระบุรี",1,null,"กรณีที่อยู่นอกแปลงพิสูจน์สิทธิ์ 30 มิ.ย. 41",{"$f":"IF(inputForm!H20=CODE!D2,IF(inputForm!H22=F2,IF(inputForm!S27=K2,1,IF(inputForm!S27=K3,2,IF(inputForm!S27=K4,7,IF(inputForm!S27=K5,3,IF(inputForm!S27=K6,4,IF(inputForm!S27=K7,5,IF(inputForm!S27=K8,6,0))))))),\"\"),\"-\")","v":"-"},"ผลการเข้าปฏิบัติการ"]
[null,"2A","ศรีราชา",2,null,"(ชื่อผู้ครอบครอง/แจ้งการพิสูจน์สิทธิ์)",{"$f":"IF(inputForm!H22=E2,inputForm!C40,\"-\")","v":"-"},"name_code"]
[null,"3A","บ้านโป่ง",3,null,null,{"$f":"inputForm!C46&inputForm!D46&inputForm!E46&inputForm!F46&inputForm!G46&inputForm!H46&inputForm!I46&inputForm!J46&inputForm!K46&inputForm!L46&inputForm!M46&inputForm!N46&inputForm!O46","v":""},"code"]
[null,"3B","สาขาเพชรบุรี",3,null,"หมายเลขบัตรประชาชน 13 หลัก",{"$f":"IF(inputForm!H22=E2,G11,\"\")","v":""},"code"]
[null,"4A","สุราษฎร์ธานี",4,null,"แนวทางดำเนินการ (รื้อถอน)",{"$f":"IF(inputForm!H20=CODE!D2,IF(inputForm!AB40=CODE!I2,1,IF(inputForm!AB40=CODE!I3,2,IF(inputForm!AB40=_2,3,IF(inputForm!AB40=CODE!I5,4,IF(inputForm!AB40=I6,5,\"-\"))))),0)","v":0},"line"]
[null,"5A","นครศรีธรรมราช",5,null,"สถานภาพต้นยางพารา",{"$f":"IF(inputForm!H20=CODE!D2,IF(inputForm!R40=\"ยังไม่เปิดกรีด\",1,IF(inputForm!R40=\"ระหว่างให้น้ำยาง\",2,IF(inputForm!R40=H4,3,\"-\"))),0)","v":0},"สถานภาพต้นยางพารา"]
[null,"6A","สงขลา",6,null,"ตรวจสอบพื้นที่แล้ว",{"$f":"IF(inputForm!H20=D2,inputForm!AK22,0)","v":0},"เนื้อที่1 area1"]
[null,"6B","สาขาปัตตานี",6,null,"แนวทางดำเนินการ (รื้อถอน)",{"$f":"IF(inputForm!H20=D2,IF(inputForm!AB40=CODE!I2,100,IF(inputForm!AB40=_2,inputForm!AD42,0)),0)","v":0},"ตัด"]
[null,"7A","นครราชสีมา",7,null,null,{"$f":"IF(inputForm!H20=D2,IF(inputForm!AB40=CODE!I2,inputForm!AD43,IF(inputForm!AB40=_2,inputForm!AD43,0)),0)","v":0},"เนื้อที่3 area3"]
[null,"8A","ขอนแก่น",8,null,null,{"$f":"IF(inputForm!AB40=CODE!I2,0,IF(inputForm!AB40=_2,inputForm!AJ42,0))","v":0},"เหลือ"]
[null,"9A","อุบลราชธานี",9,null,null,{"$f":"inputForm!AE44","v":0},"สาเหตุ"]
[null,"10A","อุดรธานี",10,null,"ผลการเข้าปฏิบัติการ",{"$f":"IF(inputForm!H22=F2,IF(inputForm!S27=K2,inputForm!AO27,IF(inputForm!S27=K4,inputForm!AO27,\"-\")),\"-\")","v":"-"},"ครั้งที่ text20"]
[null,"11A","พิษณุโลก",11,null,null,{"$f":"IF(inputForm!H22=F2,IF(inputForm!S27=K2,inputForm!W30,IF(inputForm!S27=K3,inputForm!W30,\"-\")),\"-\")","v":"-"},"ประกาศ text21"]
[null,"12A","นครสวรรค์",12,null,null,{"$f":"IF(inputForm!H22=F2,IF(inputForm!S27=K2,inputForm!AE30,IF(inputForm!S27=K4,inputForm!AE30,0)),0)","v":0},"เนื้อที่2 area2"]
[null,"13A","แพร่",13]
[null,"13B","สาขาลำปาง",13]
[null,"14A","ตาก",14]
[null,"15A","เชียงราย",15]
[null,"16A","เชียงใหม่",16]
[null,"16B","สาขาแม่สะเรียง",16]
[]
[]
["รหัส","result","กรณีที่อยู่ในแปลงพิสูจน์สิทธิ์ 30 มิ.ย. 41","กรณีที่อยู่นอกแปลงพิสูจน์สิทธิ์ 30 มิ.ย. 41","สถานภาพต้นยางพารา","line"]
[1,"ตรวจสอบพื้นที่แล้ว","รังวัดแปลงที่ดินแล้วเสร็จ","เข้าปฏิบัติการและดำเนินการตามมาตรา 22 แล้ว","ยังไม่เปิดกรีด","ตัดหมด "]
[2,"ยังไม่ได้ดำเนินการตรวจสอบ","อยู่ระหว่างการรังวัดแปลงที่ดิน","เข้าปฏิบัติการและดำเนินการตามมาตรา 25 แล้ว","ระหว่างให้น้ำยาง","ยังไม่ได้ดำเนินการตัด"]
[3,null,"ตรวจสอบการครอบครองแล้วเสร็จ","เข้าปฏิบัติการตาม พรบ. ป่าไม้ พ.ศ. 2484","หยุดกรีดยางมากกว่า 6 เดือน","อัตราการตัดฟัน"]
[4,null,"อยู่ระหว่างตรวจสอบการครอบครอง","ยังไม่เข้าปฏิบัติการ",null,"ชักลากออกมาใช้ประโยชน์"]
[5,null,null,"ราษฎรยินดีส่งคืนพื้นที่อย่างไม่มีเงื่อนไข",null,"ไม่ตัดปล่อยให้คืนสภาพเป็นป่า"]
[6,null,null,"ไม่มีการดำเนินทางคดี"]
[null,"รหัสพื้นที่","ชื่อพื้นที่ป่าอนุรักษ์","รอผลคดี"]
[null,"1001","อุทยานแห่งชาติเขาใหญ่"]
[null,"1003","อุทยานแห่งชาติทุ่งแสลงหลวง"]
{"$rows_left_out":224}